Reaction Details
TargetSerine protease 1
LigandBDBM50288406
Substrate/Competitorn/a
Meas. Tech.ChEBML_210656
Ki 0.045000±n/a nM
Citation Quan, MLWityak, JDominguez, CDuncia, JVKettner, CAEllis, CDLiauw, AYPark, JMSantella, JBKnabb, RMThoolen, MJWeber, PCWexler, RR Biaryl substituted alkylboronate esters as thrombin inhibitors Bioorg Med Chem Lett7:1595-1600 (1997)    Article
 
Serine protease 1
Name:Serine protease 1
Type:Enzyme
Mol. Mass.:26557.80
Organism:Homo sapiens (Human)
Description:P07477
Residue:247
BDBM50288406
NameBDBM50288406
Synonyms:1-(2-Acetylamino-3-phenyl-propionyl)-pyrrolidine-2-carboxylic acid (1-dihydroxyboranyl-4-guanidino-butyl)-amide CHEMBL290376
TypeSmall organic molecule
Emp. Form.C21H33BN6O5
Mol. Mass.460.335
SMILESCC(=O)N[C@H](Cc1ccccc1)C(=O)N1CCC[C@H]1C(=O)N[C@@H](CCCNC(N)=N)B(O)O