Reaction Details
TargetProthrombin
LigandBDBM50289596
Substrate/Competitorn/a
Meas. Tech.ChEBML_208719
Ki 1.7±n/a nM
Citation Quan, MLWityak, JDominguez, CDuncia, JVKettner, CAEllis, CDLiauw, AYPark, JMSantella, JBKnabb, RMThoolen, MJWeber, PCWexler, RR Biaryl substituted alkylboronate esters as thrombin inhibitors Bioorg Med Chem Lett7:1595-1600 (1997)    Article
 
Prothrombin
Name:Prothrombin
Type:Protein
Mol. Mass.:70029.57
Organism:Homo sapiens (Human)
Description:P00734
Residue:622
BDBM50289596
NameBDBM50289596
Synonyms:CHEMBL264370 | N-[(1S)-4-{[(Z)-amino(imino)methyl]amino}-1-(dihydroxyboron)butyl]-1,1'-biphenyl-4-carboxamide
TypeSmall organic molecule
Emp. Form.C18H23BN4O3
Mol. Mass.354.211
SMILESNC(=N)NCCC[C@H](NC(=O)c1ccc(cc1)-c1ccccc1)B(O)O