Reaction Details
TargetNitric oxide synthase, endothelial
LigandBDBM50230993
Substrate/Competitorn/a
Meas. Tech.ChEBML_65319
Ki 400±n/a nM
Citation Shearer, BGLee, SFranzmann, KWWhite, HASanders, DCKiff, RJGarvey, EPFurfine, ES Conformationally restricted arginine analogues as inhibitors of human nitric oxide synthase Bioorg Med Chem Lett7:1763-1768 (1997)    Article
 
Nitric oxide synthase, endothelial
Name:Nitric oxide synthase, endothelial
Type:Enzyme Catalytic Domain
Mol. Mass.:133297.84
Organism:Homo sapiens (Human)
Description:P29474
Residue:1203
BDBM50230993
NameBDBM50230993
Synonyms:(2S)-2-amino-5-[(N-methylcarbamimidoyl)amino]pentanoic acid (R)-2-Amino-5-(N'-methyl-guanidino)-pentanoic acid (S)-2-amino-5-(2-methylguanidino)pentanoic acid 2-Amino-5-(N'-methyl-guanidino)-pentanoic acid L-NMMA N(G)-mono-methyl-L-arginine N-Monomethyl-L-arginine NG-Monomethyl-L-Arginine Ngamma-monomethyl-L-arginine | Targinine
TypeSmall organic molecule
Emp. Form.C7H16N4O2
Mol. Mass.188.2275
SMILESCNC(N)=NCCC[C@H](N)C(O)=O