Reaction Details
TargetPeptidylprolyl isomerase
LigandBDBM50068596
Substrate/Competitorn/a
Meas. Tech.ChEBML_66431
Ki 60±n/a nM
Citation Hamilton, GSHuang, WConnolly, MARoss, DTGuo, HValentine, HLSuzdak, PDSteiner, JP FKBP12-binding domain analogues of FK506 are potent, nonimmunosuppressive neurotrophic agents in vitro and promote recovery in a mouse model of parkinson's disease Bioorg Med Chem Lett7:1785-1790 (1997)    Article
 
Peptidylprolyl isomerase
Name:Peptidylprolyl isomerase
Synonyms:FK506 binding protein 12
Type:PROTEIN
Mol. Mass.:11960.67
Organism:Gallus gallus
Description:ChEMBL_66431
Residue:108
BDBM50068596
NameBDBM50068596
TypeSmall organic molecule
Emp. Form.C24H35NO5
Mol. Mass.417.5384
SMILESCCC(C)(C)C(=O)C(=O)N1CCCCC1C(=O)OCCCCc1ccc(OC)cc1