Reaction Details
TargetRenin
LigandBDBM50289717
Substrate/Competitorn/a
Meas. Tech.ChEBML_105348
IC50 8200±n/a nM
Citation Yamada, YAndo, KKomiyama, KShibata, SNakamura, IHayashi, YIkegami, KUchida, I Novel low molecular renin inhibitors which show good oral blood pressure lowering effects in marmosets Bioorg Med Chem Lett7:1863-1868 (1997)    Article
 
Renin
Name:Renin
Type:Enzyme
Mol. Mass.:45058.99
Organism:Homo sapiens (Human)
Description:n/a
Residue:406
BDBM50289717
NameBDBM50289717
Synonyms:Benzo[b]thiophene-2-carboxylic acid [(S)-1-((1S,2S,4S)-1-cyclohexylmethyl-2,4-dihydroxy-5-methyl-hexylcarbamoyl)-2-(1H-imidazol-4-yl)-ethyl]-amide | CHEMBL298804
TypeSmall organic molecule
Emp. Form.C29H40N4O4S
Mol. Mass.540.717
SMILESCC(C)[C@@H](O)C[C@H](O)[C@H](CC1CCCCC1)NC(=O)[C@H](Cc1cnc[nH]1)NC(=O)c1cc2ccccc2s1