Reaction Details
TargetPepsin A
LigandBDBM50289714
Substrate/Competitorn/a
Meas. Tech.ChEBML_153982
IC50>100000±n/a nM
Citation Yamada, YAndo, KKomiyama, KShibata, SNakamura, IHayashi, YIkegami, KUchida, I Novel low molecular renin inhibitors which show good oral blood pressure lowering effects in marmosets Bioorg Med Chem Lett7:1863-1868 (1997)    Article
 
Pepsin A
Name:Pepsin A
Type:Enzyme
Mol. Mass.:41232.87
Organism:Porcine
Description:n/a
Residue:385
BDBM50289714
NameBDBM50289714
Synonyms:1H-Indole-2-carboxylic acid [(S)-1-((1S,2S,4S)-1-cyclohexylmethyl-2,4-dihydroxy-5-methyl-hexylcarbamoyl)-2-(1H-imidazol-4-yl)-ethyl]-amide | CHEMBL54677
TypeSmall organic molecule
Emp. Form.C29H41N5O4
Mol. Mass.523.6669
SMILESCC(C)[C@@H](O)C[C@H](O)[C@H](CC1CCCCC1)NC(=O)[C@H](Cc1cnc[nH]1)NC(=O)c1cc2ccccc2[nH]1