Reaction Details
TargetNeuronal acetylcholine receptor subunit alpha-3/beta-2
LigandBDBM50083057
Substrate/Competitorn/a
Meas. Tech.ChEMBL_143246 (CHEMBL752534)
IC50 15±n/a nM
Citation Olesen, PHSwedberg, MDEskesen, KJudge, MEEgebjerg, JTønder, JERasmussen, TSheardown, MJRimvall, K Identification of novel (isoxazole)methylene-1-azabicyclic compounds with high affinity for the central nicotinic cholinergic receptor Bioorg Med Chem Lett7:1963-1968 (1997)    Article
 
Neuronal acetylcholine receptor subunit alpha-3/beta-2
Name:Neuronal acetylcholine receptor subunit alpha-3/beta-2
Type:n/a
Mol. Mass.:n/a
Description:ASSAY_ID of EBI is 143246
Components:This complex has 2 components.
Component 1
Name:Neuronal acetylcholine receptor subunit beta-2
Synonyms:ACHB2_HUMAN Neuronal acetylcholine receptor protein beta-2 subunit | Nicotinic acetylcholine receptor alpha3/beta2/alpha5
Type:Protein
Mol. Mass.:57020.50
Organism:Homo sapiens (Human)
Description:P17787
Residue:502
Component 2
Name:Neuronal acetylcholine receptor subunit alpha-3
Synonyms:ACHA3_HUMAN Cholinergic, Nicotinic Alpha3Beta2 Cholinergic, Nicotinic Alpha3Beta4x NACHRA3 Neuronal acetylcholine receptor subunit alpha-3 nicotinic central
Type:Enzyme Catalytic Domain
Mol. Mass.:57479.03
Organism:Homo sapiens (Human)
Description:Cholinergic, Nicotinic Alpha3Beta2 0 HUMAN::P32297
Residue:505
BDBM50083057
NameBDBM50083057
Synonyms:3-(3-Methyl-isoxazol-5-ylmethylene)-1-aza-bicyclo[2.2.1]heptane CHEMBL291780
TypeSmall organic molecule
Emp. Form.C11H14N2O
Mol. Mass.190.2417
SMILESCc1cc(\C=C2/CN3CCC2C3)on1