Reaction Details
TargetMuscarinic acetylcholine receptor M1/M2/M3/M4/M5
LigandBDBM50083075
Substrate/Competitorn/a
Meas. Tech.ChEMBL_138204 (CHEMBL748433)
IC50 2800±n/a nM
Citation Olesen, PHSwedberg, MDEskesen, KJudge, MEEgebjerg, JTønder, JERasmussen, TSheardown, MJRimvall, K Identification of novel (isoxazole)methylene-1-azabicyclic compounds with high affinity for the central nicotinic cholinergic receptor Bioorg Med Chem Lett7:1963-1968 (1997)    Article
 
Muscarinic acetylcholine receptor M1/M2/M3/M4/M5
Name:Muscarinic acetylcholine receptor M1/M2/M3/M4/M5
Synonyms:Muscarinic acetylcholine receptor
Type:n/a
Mol. Mass.:n/a
Description:ASSAY_ID of ChEMBL is 1821274
Components:This complex has 5 components.
Component 1
Name:Muscarinic acetylcholine receptor M1
Type:Enzyme Catalytic Domain
Mol. Mass.:51390.46
Organism:RAT
Description:P08482
Residue:460
Component 2
Name:Muscarinic acetylcholine receptor M3
Synonyms:ACM3_RAT Chrm-3 | Chrm3
Type:Enzyme Catalytic Domain
Mol. Mass.:66086.66
Organism:RAT
Description:Cholinergic, muscarinic M3 CHRM3 RAT::P08483
Residue:589
Component 3
Name:Muscarinic acetylcholine receptor M4
Synonyms:ACM4_RAT Chrm-4 | Chrm4
Type:Enzyme Catalytic Domain
Mol. Mass.:52841.70
Organism:RAT
Description:Cholinergic, muscarinic M4 CHRM4 RAT::P08485
Residue:477
Component 4
Name:Muscarinic acetylcholine receptor M5
Synonyms:ACM5_RAT Chrm-5 Muscarinic acetylcholine receptor | Muscarinic acetylcholine receptor M5
Type:Enzyme Catalytic Domain
Mol. Mass.:60161.80
Organism:RAT
Description:Cholinergic, muscarinic M5 CHRM5 RAT::P08911
Residue:531
Component 5
Name:Muscarinic acetylcholine receptor M2
Synonyms:ACM2_RAT Chrm-2 | Chrm2
Type:Enzyme Catalytic Domain
Mol. Mass.:51555.53
Organism:RAT
Description:P10980
Residue:466
BDBM50083075
NameBDBM50083075
Synonyms:3-(3-Methyl-isoxazol-5-ylmethylene)-1-aza-bicyclo[2.2.1]heptane CHEMBL291442
TypeSmall organic molecule
Emp. Form.C11H14N2O
Mol. Mass.190.2417
SMILESCc1cc(\C=C2\CN3CCC2C3)on1