Reaction Details
TargetCaspase-1
LigandBDBM50290011
Substrate/Competitorn/a
Meas. Tech.ChEBML_91011
Ki 900±n/a nM
Citation Golec, JMMullican, MDMurcko, MAWilson, KPKay, DPJones, SDMurdoch, RBemis, GWRaybuck, SALuong, YPLivingston, DJ Structure-based design of non-peptidic pyridone aldehydes as inhibitors of interleukin-1β converting enzyme Bioorg Med Chem Lett7:2181-2186 (1997)    Article
 
Caspase-1
Name:Caspase-1
Type:Enzyme
Mol. Mass.:45154.13
Organism:Homo sapiens (Human)
Description:P29466
Residue:404
BDBM50290011
NameBDBM50290011
Synonyms:(S)-4-Oxo-3-{2-[2-oxo-6-phenyl-3-(3-phenyl-propionylamino)-2H-pyridin-1-yl]-acetylamino}-butyric acid | CHEMBL68669
TypeSmall organic molecule
Emp. Form.C26H25N3O6
Mol. Mass.475.4932
SMILESOC(=O)C[C@H](NC(=O)Cn1c(ccc(NC(=O)CCc2ccccc2)c1=O)-c1ccccc1)C=O