Reaction Details
TargetD(4) dopamine receptor
LigandBDBM50290030
Substrate/Competitorn/a
Meas. Tech.ChEBML_58934
Ki 5±n/a nM
Citation Haworth, KEHarrison, TKulagowski, JJLeeson, PDOwens, APRidgill, MPTeall, MRFielding, MChapman, KEmms, FMarwood, RPatel, SMoss, KL 4-Heterocyclyl tetrahydropyridines as selective ligands for the human dopamine D4 receptor Bioorg Med Chem Lett7:2211-2216 (1997)    Article
 
D(4) dopamine receptor
Name:D(4) dopamine receptor
Type:Enzyme
Mol. Mass.:48373.19
Organism:Homo sapiens (Human)
Description:P21917
Residue:419
BDBM50290030
NameBDBM50290030
Synonyms:2-(1-Benzyl-1,2,3,6-tetrahydro-pyridin-4-yl)-benzothiazole | CHEMBL69355
TypeSmall organic molecule
Emp. Form.C19H18N2S
Mol. Mass.306.425
SMILESC(N1CCC(=CC1)c1nc2ccccc2s1)c1ccccc1