Reaction Details
Target72 kDa type IV collagenase/Collagenase 3/Interstitial collagenase/Matrix metalloproteinase-9/Neutrophil collagenase
LigandBDBM50290085
Substrate/Competitorn/a
Meas. Tech.ChEMBL_49502 (CHEMBL662797)
IC50 0.500000±n/a nM
Citation Broadhurst, MJBrown, PALawton, GBallantyne, NBorkakoti, NBottomley, KMCooper, MIEatherton, AJKilford, IRMalsher, PJNixon, JSLewis, EJSutton, BMJohnson, WH Design and synthesis of the cartilage protective agent (CPA, Ro32-3555) Bioorg Med Chem Lett7:2299-2302 (1997)    Article
 
72 kDa type IV collagenase/Collagenase 3/Interstitial collagenase/Matrix metalloproteinase-9/Neutrophil collagenase
Name:72 kDa type IV collagenase/Collagenase 3/Interstitial collagenase/Matrix metalloproteinase-9/Neutrophil collagenase
Synonyms:Collagenase
Type:n/a
Mol. Mass.:n/a
Description:ASSAY_ID of ChEMBL is 49490
Components:This complex has 5 components.
Component 1
Name:Matrix metalloproteinase-9
Type:Enzyme
Mol. Mass.:78452.28
Organism:Homo sapiens (Human)
Description:P14780
Residue:707
Component 2
Name:Collagenase 3
Synonyms:MMP-13 MMP13_HUMAN Matrix metalloproteinase-13 (MMP-13) | Matrix metalloproteinase-13 (MMP13)
Type:Enzyme
Mol. Mass.:53808.06
Organism:Homo sapiens (Human)
Description:P45452
Residue:471
Component 3
Name:Interstitial collagenase
Synonyms:CLG MMP1 Matrix metalloproteinase-1 | Matrix metalloproteinase-1 (MMP-1)
Type:Enzyme
Mol. Mass.:54010.26
Organism:Homo sapiens (Human)
Description: P03956
Residue:469
Component 4
Name:72 kDa type IV collagenase
Synonyms:72 kDa gelatinase CLG4A Gelatinase A (MMP-2) MMP2_HUMAN Matrix metalloproteinase-2 (MMP 2) Matrix metalloproteinases 2 (MMP-2) | TBE-1
Type:Enzyme
Mol. Mass.:73870.36
Organism:Homo sapiens (Human)
Description: P08253
Residue:660
Component 5
Name:Neutrophil collagenase
Synonyms:CLG1 MMP8 Matrix metalloproteinase-8 PMNL collagenase | PMNL-CL
Type:Enzyme
Mol. Mass.:53413.48
Organism:Homo sapiens (Human)
Description:P22894
Residue:467
BDBM50290085
NameBDBM50290085
Synonyms:(2S,3R)-N*4*-((R)-2,2-Dimethyl-1-methylcarbamoyl-propyl)-2-(1,3-dioxo-1,3-dihydro-isoindol-2-ylmethyl)-N*1*-hydroxy-3-isobutyl-succinamide | CHEMBL74670
TypeSmall organic molecule
Emp. Form.C24H34N4O6
Mol. Mass.474.55
SMILESCNC(=O)[C@H](NC(=O)[C@H](CC(C)C)[C@@H](CN1C(=O)c2ccccc2C1=O)C(=O)NO)C(C)(C)C