Reaction Details
TargetMatrix metalloproteinase-9
LigandBDBM50290090
Substrate/Competitorn/a
Meas. Tech.ChEBML_71656
IC50 59±n/a nM
Citation Broadhurst, MJBrown, PALawton, GBallantyne, NBorkakoti, NBottomley, KMCooper, MIEatherton, AJKilford, IRMalsher, PJNixon, JSLewis, EJSutton, BMJohnson, WH Design and synthesis of the cartilage protective agent (CPA, Ro32-3555) Bioorg Med Chem Lett7:2299-2302 (1997)    Article
 
Matrix metalloproteinase-9
Name:Matrix metalloproteinase-9
Type:Enzyme
Mol. Mass.:78452.28
Organism:Homo sapiens (Human)
Description:P14780
Residue:707
BDBM50290090
NameBDBM50290090
Synonyms:(2S,3R)-3-Cyclopentylmethyl-N-hydroxy-4-oxo-4-piperidin-1-yl-2-(3,4,4-trimethyl-2,5-dioxo-imidazolidin-1-ylmethyl)-butyramide Ro-32-3555
TypeSmall organic molecule
Emp. Form.C22H36N4O5
Mol. Mass.436.545
SMILESCN1C(=O)N(C[C@H]([C@@H](CC2CCCC2)C(=O)N2CCCCC2)C(=O)NO)C(=O)C1(C)C