Reaction Details
TargetMatrix metalloproteinase-9
LigandBDBM50290086
Substrate/Competitorn/a
Meas. Tech.ChEBML_71656
IC50 10±n/a nM
Citation Broadhurst, MJBrown, PALawton, GBallantyne, NBorkakoti, NBottomley, KMCooper, MIEatherton, AJKilford, IRMalsher, PJNixon, JSLewis, EJSutton, BMJohnson, WH Design and synthesis of the cartilage protective agent (CPA, Ro32-3555) Bioorg Med Chem Lett7:2299-2302 (1997)    Article
 
Matrix metalloproteinase-9
Name:Matrix metalloproteinase-9
Type:Enzyme
Mol. Mass.:78452.28
Organism:Homo sapiens (Human)
Description:P14780
Residue:707
BDBM50290086
NameBDBM50290086
Synonyms:(R)-N*1*-[2,2-Dimethyl-1-((R)-methylcarbamoyl)-propyl]-N*4*-hydroxy-2-isobutyl-succinamide Ro-37-9790
TypeSmall organic molecule
Emp. Form.C15H29N3O4
Mol. Mass.315.4085
SMILESCNC(=O)[C@H](NC(=O)[C@H](CC(C)C)CC(=O)NO)C(C)(C)C