Reaction Details
TargetStromelysin-1
LigandBDBM50290085
Substrate/Competitorn/a
Meas. Tech.ChEBML_205639
IC50 9.1±n/a nM
Citation Broadhurst, MJBrown, PALawton, GBallantyne, NBorkakoti, NBottomley, KMCooper, MIEatherton, AJKilford, IRMalsher, PJNixon, JSLewis, EJSutton, BMJohnson, WH Design and synthesis of the cartilage protective agent (CPA, Ro32-3555) Bioorg Med Chem Lett7:2299-2302 (1997)    Article
 
Stromelysin-1
Name:Stromelysin-1
Type:Enzyme
Mol. Mass.:53973.13
Organism:Homo sapiens (Human)
Description: P08254
Residue:477
BDBM50290085
NameBDBM50290085
Synonyms:(2S,3R)-N*4*-((R)-2,2-Dimethyl-1-methylcarbamoyl-propyl)-2-(1,3-dioxo-1,3-dihydro-isoindol-2-ylmethyl)-N*1*-hydroxy-3-isobutyl-succinamide | CHEMBL74670
TypeSmall organic molecule
Emp. Form.C24H34N4O6
Mol. Mass.474.55
SMILESCNC(=O)[C@H](NC(=O)[C@H](CC(C)C)[C@@H](CN1C(=O)c2ccccc2C1=O)C(=O)NO)C(C)(C)C