Reaction Details
TargetSigma non-opioid intracellular receptor 1
LigandBDBM50290092
Substrate/Competitorn/a
Meas. Tech.ChEBML_201429
Ki 2.9±n/a nM
Citation Yamashita, ATakahashi, NMochizuki, DTsujita, RYamada, SKawakubo, HSuzuki, YWatanabe, H An aromatic moiety is not essential for pharmacophore binding to sigma binding sites: Synthesis of N-alkylazacycloheptane derivatives as potent sigma ligands Bioorg Med Chem Lett7:2303-2306 (1997)    Article
 
Sigma non-opioid intracellular receptor 1
Name:Sigma non-opioid intracellular receptor 1
Type:Enzyme Catalytic Domain
Mol. Mass.:25124.85
Organism:Homo sapiens (Human)
Description:Q99720
Residue:223
BDBM50290092
NameBDBM50290092
Synonyms:(S)-3-(2-Cycloheptyl-ethyl)-1,8,8-trimethyl-3-aza-bicyclo[3.2.1]octane | CHEMBL77817
TypeSmall organic molecule
Emp. Form.C19H35N
Mol. Mass.277.4879
SMILESCC1(C)C2CC[C@]1(C)CN(CCC1CCCCCC1)C2