Reaction Details
TargetSigma non-opioid intracellular receptor 1
LigandBDBM50001044
Substrate/Competitorn/a
Meas. Tech.ChEBML_201429
Ki 157±n/a nM
Citation Yamashita, ATakahashi, NMochizuki, DTsujita, RYamada, SKawakubo, HSuzuki, YWatanabe, H An aromatic moiety is not essential for pharmacophore binding to sigma binding sites: Synthesis of N-alkylazacycloheptane derivatives as potent sigma ligands Bioorg Med Chem Lett7:2303-2306 (1997)    Article
 
Sigma non-opioid intracellular receptor 1
Name:Sigma non-opioid intracellular receptor 1
Type:Enzyme Catalytic Domain
Mol. Mass.:25124.85
Organism:Homo sapiens (Human)
Description:Q99720
Residue:223
BDBM50001044
NameBDBM50001044
Synonyms:(1S,9S,13S)-10-allyl-1,13-dimethyl-10-azatricyclo[7.3.1.0~2,7~]trideca-2,4,6-trien-4-ol CHEMBL74019
TypeSmall organic molecule
Emp. Form.C17H23NO
Mol. Mass.257.3706
SMILESC[C@@H]1[C@@H]2Cc3ccc(O)cc3[C@]1(C)CCN2CC=C