Reaction Details
TargetRetinoic acid receptor beta
LigandBDBM31892
Substrate/Competitorn/a
Meas. Tech.ChEBML_217648
Ki 0.500000±n/a nM
Citation Wong, MFRepa, JJClagett-Dame, MCurley, RW Synthesis and receptor binding affinity of conformationally restricted retinoic acid analogues Bioorg Med Chem Lett7:2313-2318 (1997)    Article
 
Retinoic acid receptor beta
Name:Retinoic acid receptor beta
Type:PROTEIN
Mol. Mass.:50498.70
Organism:Homo sapiens (Human)
Description:ChEMBL_1458015
Residue:455
BDBM31892
NameBDBM31892
Synonyms:9-cis retinoic acid CHEMBL705 alitretinoin
TypeSmall organic molecule
Emp. Form.C20H28O2
Mol. Mass.300.4351
SMILESC\C(\C=C\C1=C(C)CCCC1(C)C)=C\C=C\C(\C)=C\C(O)=O