Reaction Details
TargetAdenosine receptor A1
LigandBDBM50290168
Substrate/Competitorn/a
Meas. Tech.ChEBML_28992
Ki 61±n/a nM
Citation Shimada, JKoike, NNonaka, HShiozaki, SYanagawa, KKanda, TKobayashi, HIchimura, MNakamura, JKase, HSuzuki, F Adenosine A2A antagonists with potent anti-cataleptic activity Bioorg Med Chem Lett7:2349-2352 (1997)    Article
 
Adenosine receptor A1
Name:Adenosine receptor A1
Type:Protein
Mol. Mass.:36704.13
Organism:Rattus norvegicus (rat)
Description:n/a
Residue:326
BDBM50290168
NameBDBM50290168
Synonyms:1,3-Diethyl-7-methyl-8-[(E)-2-(2,3,4-trimethoxy-phenyl)-vinyl]-3,7-dihydro-purine-2,6-dione | CHEMBL77699
TypeSmall organic molecule
Emp. Form.C21H26N4O5
Mol. Mass.414.4549
SMILESCCn1c2nc(\C=C\c3ccc(OC)c(OC)c3OC)n(C)c2c(=O)n(CC)c1=O