Reaction Details
TargetAdenosine receptor A2a
LigandBDBM50290165
Substrate/Competitorn/a
Meas. Tech.ChEMBL_30920 (CHEMBL647730)
Ki 0.670000±n/a nM
Citation Shimada, JKoike, NNonaka, HShiozaki, SYanagawa, KKanda, TKobayashi, HIchimura, MNakamura, JKase, HSuzuki, F Adenosine A2A antagonists with potent anti-cataleptic activity Bioorg Med Chem Lett7:2349-2352 (1997)    Article
 
Adenosine receptor A2a
Name:Adenosine receptor A2a
Type:G Protein-Coupled Receptor (GPCR)
Mol. Mass.:45015.65
Organism:Rattus norvegicus (rat)
Description:Rat A2A receptors expressed in CHO cells.
Residue:410
BDBM50290165
NameBDBM50290165
Synonyms:8-[(E)-2-(2,4-Dimethoxy-3-methyl-phenyl)-vinyl]-1,3-diethyl-7-methyl-3,7-dihydro-purine-2,6-dione | CHEMBL77691
TypeSmall organic molecule
Emp. Form.C21H26N4O4
Mol. Mass.398.4555
SMILESCCn1c2nc(\C=C\c3ccc(OC)c(C)c3OC)n(C)c2c(=O)n(CC)c1=O