Reaction Details
TargetAdenosine receptor A2a
LigandBDBM50290169
Substrate/Competitorn/a
Meas. Tech.ChEBML_30920
Ki 3.9±n/a nM
Citation Shimada, JKoike, NNonaka, HShiozaki, SYanagawa, KKanda, TKobayashi, HIchimura, MNakamura, JKase, HSuzuki, F Adenosine A2A antagonists with potent anti-cataleptic activity Bioorg Med Chem Lett7:2349-2352 (1997)    Article
 
Adenosine receptor A2a
Name:Adenosine receptor A2a
Type:G Protein-Coupled Receptor (GPCR)
Mol. Mass.:45015.65
Organism:Rattus norvegicus (rat)
Description:Rat A2A receptors expressed in CHO cells.
Residue:410
BDBM50290169
NameBDBM50290169
Synonyms:8-[(E)-2-(4-Methoxy-2,3-dimethyl-phenyl)-vinyl]-7-methyl-1,3-dipropyl-3,7-dihydro-purine-2,6-dione | CHEMBL78317
TypeSmall organic molecule
Emp. Form.C23H30N4O3
Mol. Mass.410.5093
SMILESCCCn1c2nc(\C=C\c3ccc(OC)c(C)c3C)n(C)c2c(=O)n(CCC)c1=O