Reaction Details
TargetAdenosine receptor A1
LigandBDBM50006703
Substrate/Competitorn/a
Meas. Tech.ChEBML_28992
Ki 63±n/a nM
Citation Shimada, JKoike, NNonaka, HShiozaki, SYanagawa, KKanda, TKobayashi, HIchimura, MNakamura, JKase, HSuzuki, F Adenosine A2A antagonists with potent anti-cataleptic activity Bioorg Med Chem Lett7:2349-2352 (1997)    Article
 
Adenosine receptor A1
Name:Adenosine receptor A1
Type:Protein
Mol. Mass.:36704.13
Organism:Rattus norvegicus (rat)
Description:n/a
Residue:326
BDBM50006703
NameBDBM50006703
Synonyms:8-[(E)-2-(4-Methoxy-phenyl)-vinyl]-7-methyl-1,3-dipropyl-3,7-dihydro-purine-2,6-dione CHEMBL306633
TypeSmall organic molecule
Emp. Form.C21H26N4O3
Mol. Mass.382.4561
SMILESCCCn1c2nc(\C=C\c3ccc(OC)cc3)n(C)c2c(=O)n(CCC)c1=O