Reaction Details
TargetAdenosine receptor A1
LigandBDBM50006710
Substrate/Competitorn/a
Meas. Tech.ChEBML_28992
Ki 390±n/a nM
Citation Shimada, JKoike, NNonaka, HShiozaki, SYanagawa, KKanda, TKobayashi, HIchimura, MNakamura, JKase, HSuzuki, F Adenosine A2A antagonists with potent anti-cataleptic activity Bioorg Med Chem Lett7:2349-2352 (1997)    Article
 
Adenosine receptor A1
Name:Adenosine receptor A1
Type:Protein
Mol. Mass.:36704.13
Organism:Rattus norvegicus (rat)
Description:n/a
Residue:326
BDBM50006710
NameBDBM50006710
Synonyms:8-[(E)-2-(3,4-Dimethoxy-phenyl)-vinyl]-7-methyl-1,3-dipropyl-3,7-dihydro-purine-2,6-dione 8-[2-(3,4-Dimethoxy-phenyl)-vinyl]-7-methyl-1,3-dipropyl-3,7-dihydro-purine-2,6-dione; compound with 8-[2-(3,4-dimethoxy-phenyl)-vinyl]-7-methyl-1,3-dipropyl-3,7-dihydro-purine-2,6-dione CHEMBL27508 | KF-17837
TypeSmall organic molecule
Emp. Form.C22H28N4O4
Mol. Mass.412.4821
SMILESCCCn1c2nc(\C=C\c3ccc(OC)c(OC)c3)n(C)c2c(=O)n(CCC)c1=O