Reaction Details
TargetAdenosine receptor A1
LigandBDBM50290172
Substrate/Competitorn/a
Meas. Tech.ChEBML_28992
Ki 2500±n/a nM
Citation Shimada, JKoike, NNonaka, HShiozaki, SYanagawa, KKanda, TKobayashi, HIchimura, MNakamura, JKase, HSuzuki, F Adenosine A2A antagonists with potent anti-cataleptic activity Bioorg Med Chem Lett7:2349-2352 (1997)    Article
 
Adenosine receptor A1
Name:Adenosine receptor A1
Type:Protein
Mol. Mass.:36704.13
Organism:Rattus norvegicus (rat)
Description:n/a
Residue:326
BDBM50290172
NameBDBM50290172
Synonyms:8-[(E)-2-(2,4-Dimethoxy-phenyl)-vinyl]-1,3-diethyl-7-methyl-3,7-dihydro-purine-2,6-dione | CHEMBL73827
TypeSmall organic molecule
Emp. Form.C20H24N4O4
Mol. Mass.384.429
SMILESCCn1c2nc(\C=C\c3ccc(OC)cc3OC)n(C)c2c(=O)n(CC)c1=O