Reaction Details
TargetRetinoic acid receptor RXR-gamma
LigandBDBM50290186
Substrate/Competitorn/a
Meas. Tech.ChEMBL_197229 (CHEMBL798205)
Ki 7±n/a nM
Citation Farmer, LJJeong, SKallel, EAKoch, SSCroston, GEFlatten, KSHeyman, RANadzan, AM Synthesis and structure-activity relationships of potent retinoid X receptor ligands Bioorg Med Chem Lett7:2393-2398 (1997)    Article
 
Retinoic acid receptor RXR-gamma
Name:Retinoic acid receptor RXR-gamma
Type:PROTEIN
Mol. Mass.:50900.28
Organism:Mus musculus
Description:ChEMBL_196589
Residue:463
BDBM50290186
NameBDBM50290186
Synonyms:(2E,4E)-3-Methyl-5-[(1R,2R)-1-methyl-2-(5,5,8,8-tetramethyl-5,6,7,8-tetrahydro-naphthalen-2-yl)-cyclopentyl]-penta-2,4-dienoic acid | CHEMBL312395
TypeSmall organic molecule
Emp. Form.C26H36O2
Mol. Mass.380.5628
SMILESC\C(\C=C\[C@@]1(C)CCC[C@@H]1c1ccc2c(c1)C(C)(C)CCC2(C)C)=C/C(O)=O