Reaction Details
TargetRetinoic acid receptor RXR-alpha
LigandBDBM50290189
Substrate/Competitorn/a
Meas. Tech.ChEMBL_196755 (CHEMBL800544)
EC50 169±n/a nM
Citation Farmer, LJJeong, SKallel, EAKoch, SSCroston, GEFlatten, KSHeyman, RANadzan, AM Synthesis and structure-activity relationships of potent retinoid X receptor ligands Bioorg Med Chem Lett7:2393-2398 (1997)    Article
 
Retinoic acid receptor RXR-alpha
Name:Retinoic acid receptor RXR-alpha
Type:PROTEIN
Mol. Mass.:50820.38
Organism:Homo sapiens (Human)
Description:ChEMBL_1456363
Residue:462
BDBM50290189
NameBDBM50290189
Synonyms:(2E,4E)-3-Methyl-5-[(1S,2S)-4-methylene-2-(5,5,8,8-tetramethyl-5,6,7,8-tetrahydro-naphthalen-2-yl)-cyclopentyl]-penta-2,4-dienoic acid | CHEMBL80424
TypeSmall organic molecule
Emp. Form.C26H34O2
Mol. Mass.378.547
SMILESC\C(\C=C\[C@@H]1CC(=C)C[C@@H]1c1ccc2c(c1)C(C)(C)CCC2(C)C)=C/C(O)=O