Reaction Details
TargetRetinoic acid receptor RXR-beta
LigandBDBM50290192
Substrate/Competitorn/a
Meas. Tech.ChEMBL_197063 (CHEMBL806652)
EC50 3±n/a nM
Citation Farmer, LJJeong, SKallel, EAKoch, SSCroston, GEFlatten, KSHeyman, RANadzan, AM Synthesis and structure-activity relationships of potent retinoid X receptor ligands Bioorg Med Chem Lett7:2393-2398 (1997)    Article
 
Retinoic acid receptor RXR-beta
Name:Retinoic acid receptor RXR-beta
Type:PROTEIN
Mol. Mass.:55877.78
Organism:Mus musculus
Description:ChEMBL_196588
Residue:520
BDBM50290192
NameBDBM50290192
Synonyms:3-Methyl-5-[5-(5,5,8,8-tetramethyl-5,6,7,8-tetrahydro-naphthalen-2-yl)-bicyclo[3.1.0]hex-1-yl]-penta-2,4-dienoic acid | CHEMBL310047
TypeSmall organic molecule
Emp. Form.C26H34O2
Mol. Mass.378.547
SMILESC\C(\C=C\[C@]12CC1(CCC2)c1ccc2c(c1)C(C)(C)CCC2(C)C)=C/C(O)=O