Reaction Details
TargetRetinoic acid receptor gamma
LigandBDBM50290193
Substrate/Competitorn/a
Meas. Tech.ChEBML_195991
Ki>1000±n/a nM
Citation Farmer, LJJeong, SKallel, EAKoch, SSCroston, GEFlatten, KSHeyman, RANadzan, AM Synthesis and structure-activity relationships of potent retinoid X receptor ligands Bioorg Med Chem Lett7:2393-2398 (1997)    Article
 
Retinoic acid receptor gamma
Name:Retinoic acid receptor gamma
Type:PROTEIN
Mol. Mass.:50345.43
Organism:Homo sapiens (Human)
Description:ChEMBL_1458016
Residue:454
BDBM50290193
NameBDBM50290193
Synonyms:3-Methyl-5-[2-(3,5,5,8,8-pentamethyl-5,6,7,8-tetrahydro-naphthalen-2-yl)-cyclopent-1-enyl]-penta-2,4-dienoic acid | CHEMBL312737
TypeSmall organic molecule
Emp. Form.C26H34O2
Mol. Mass.378.547
SMILESC\C(\C=C\C1=C(CCC1)c1cc2c(cc1C)C(C)(C)CCC2(C)C)=C/C(O)=O