Reaction Details
TargetMelatonin receptor type 1B
LigandBDBM50290238
Substrate/Competitorn/a
Meas. Tech.ChEBML_105267
Ki 1.2±n/a nM
Citation Li, PKChu, GHGillen, MLParekh, TWitt-Enderby, PA The development of a charged melatonin receptor ligand Bioorg Med Chem Lett7:2409-2414 (1997)    Article
 
Melatonin receptor type 1B
Name:Melatonin receptor type 1B
Type:Enzyme
Mol. Mass.:40203.54
Organism:Homo sapiens (Human)
Description:P49286
Residue:362
BDBM50290238
NameBDBM50290238
Synonyms:CHEMBL80736 | N-[2-(2-Ethoxy-7-methoxy-naphthalen-1-yl)-ethyl]-propionamide
TypeSmall organic molecule
Emp. Form.C18H23NO3
Mol. Mass.301.3801
SMILESCCOc1ccc2ccc(OC)cc2c1CCNC(=O)CC