Reaction Details
TargetMelatonin receptor type 1B
LigandBDBM29611
Substrate/Competitorn/a
Meas. Tech.ChEMBL_105267 (CHEMBL713139)
Ki 0.150±n/a nM
Citation Li, PKChu, GHGillen, MLParekh, TWitt-Enderby, PA The development of a charged melatonin receptor ligand Bioorg Med Chem Lett7:2409-2414 (1997)    Article
 
Melatonin receptor type 1B
Name:Melatonin receptor type 1B
Type:Enzyme
Mol. Mass.:40203.54
Organism:Homo sapiens (Human)
Description:P49286
Residue:362
BDBM29611
NameBDBM29611
Synonyms:2-Iodomelatonin Melatonin,2-Iodo
TypeSmall organic molecule
Emp. Form.C13H15IN2O2
Mol. Mass.358.1749
SMILESCOc1ccc2[nH]c(I)c(CCNC(C)=O)c2c1