Reaction Details
TargetMelatonin receptor type 1A
LigandBDBM50035202
Substrate/Competitorn/a
Meas. Tech.ChEBML_105103
Ki 0.099000±n/a nM
Citation Li, PKChu, GHGillen, MLParekh, TWitt-Enderby, PA The development of a charged melatonin receptor ligand Bioorg Med Chem Lett7:2409-2414 (1997)    Article
 
Melatonin receptor type 1A
Name:Melatonin receptor type 1A
Type:Enzyme
Mol. Mass.:39392.94
Organism:Homo sapiens (Human)
Description:P48039
Residue:350
BDBM50035202
NameBDBM50035202
Synonyms:CHEMBL291857 | N-[2-(2,7-Dimethoxy-naphthalen-1-yl)-ethyl]-propionamide
TypeSmall organic molecule
Emp. Form.C17H21NO3
Mol. Mass.287.3535
SMILESCCC(=O)NCCc1c(OC)ccc2ccc(OC)cc12