Reaction Details
TargetProthrombin
LigandBDBM50081158
Substrate/Competitorn/a
Meas. Tech.ChEBML_48295
IC50 2.1±n/a nM
Citation Semple, JEMinami, NKTamura, SYBrunck, TKNutt, RFRipka, WC Rational design and synthesis of a novel, selective class of thrombin inhibitors: P1-argininal derivatives incorporating P3---P4 quaternary lactam dipeptide surrogates Bioorg Med Chem Lett7:2421-2426 (1997)    Article
 
Prothrombin
Name:Prothrombin
Type:Protein
Mol. Mass.:70029.57
Organism:Homo sapiens (Human)
Description:P00734
Residue:622
BDBM50081158
NameBDBM50081158
Synonyms:2-((R)-3-Amino-3-benzyl-2-oxo-piperidin-1-yl)-N-((S)-1-carbamimidoyl-2-hydroxy-piperidin-3-yl)-acetamide CHEMBL79422
TypeSmall organic molecule
Emp. Form.C20H30N6O3
Mol. Mass.402.4906
SMILESNC(=N)N1CCC[C@H](NC(=O)CN2CCC[C@@](N)(Cc3ccccc3)C2=O)C1O