Reaction Details
TargetPeroxisome proliferator-activated receptor gamma
LigandBDBM50290269
Substrate/Competitorn/a
Meas. Tech.ChEBML_154360
Ki 1400±n/a nM
Citation Tomkinson, NCSefler, AMPlunket, KDBlanchard, SGParks, DJWillson, TM Solid-phase synthesis of hybrid thiazolidinedione-fatty acid PPARγ ligands Bioorg Med Chem Lett7:2491-2496 (1997)    Article
 
Peroxisome proliferator-activated receptor gamma
Name:Peroxisome proliferator-activated receptor gamma
Type:Nuclear Receptor
Mol. Mass.:57613.46
Organism:Homo sapiens (Human)
Description:P37231
Residue:505
BDBM50290269
NameBDBM50290269
Synonyms:CHEMBL83677 | Heptanoic acid {2-[4-(2,4-dioxo-thiazolidin-5-ylmethyl)-phenoxy]-ethyl}-amide
TypeSmall organic molecule
Emp. Form.C19H26N2O4S
Mol. Mass.378.486
SMILESCCCCCCC(=O)NCCOc1ccc(Cc2sc(=O)[nH]c2O)cc1