Reaction Details
TargetPeroxisome proliferator-activated receptor gamma
LigandBDBM50290272
Substrate/Competitorn/a
Meas. Tech.ChEBML_154360
Ki>10000±n/a nM
Citation Tomkinson, NCSefler, AMPlunket, KDBlanchard, SGParks, DJWillson, TM Solid-phase synthesis of hybrid thiazolidinedione-fatty acid PPARγ ligands Bioorg Med Chem Lett7:2491-2496 (1997)    Article
 
Peroxisome proliferator-activated receptor gamma
Name:Peroxisome proliferator-activated receptor gamma
Type:Nuclear Receptor
Mol. Mass.:57613.46
Organism:Homo sapiens (Human)
Description:P37231
Residue:505
BDBM50290272
NameBDBM50290272
Synonyms:(E)-Pent-3-enoic acid {2-[4-(2,4-dioxo-thiazolidin-5-ylmethyl)-phenoxy]-ethyl}-amide | CHEMBL79557
TypeSmall organic molecule
Emp. Form.C17H20N2O4S
Mol. Mass.348.417
SMILESC\C=C\CC(=O)NCCOc1ccc(Cc2sc(=O)[nH]c2O)cc1