Reaction Details
TargetVoltage-dependent L-type calcium channel subunit alpha-1C
LigandBDBM50214774
Substrate/Competitorn/a
Meas. Tech.ChEBML_53042
IC50 100±n/a nM
Citation Straub, AGoehrt, ABorn, L 4-Biaryl-substituted dihydropyridines with an unusual antiperiplanar conformation Bioorg Med Chem Lett7:2519-2522 (1997)    Article
 
Voltage-dependent L-type calcium channel subunit alpha-1C
Name:Voltage-dependent L-type calcium channel subunit alpha-1C
Type:Enzyme Catalytic Domain
Mol. Mass.:248979.79
Organism:Homo sapiens (Human)
Description:Calcium channel (Type L) 0 HUMAN::Q13936
Residue:2221
BDBM50214774
NameBDBM50214774
Synonyms:CHEMBL3392230
TypeSmall organic molecule
Emp. Form.C26H23N3O2
Mol. Mass.409.4797
SMILESCCOC(=O)C1=C(C)NC(C)=C(C#N)[C@@H]1c1cnccc1-c1ccc2ccccc2c1