Reaction Details
TargetSubstance-P receptor
LigandBDBM50290306
Substrate/Competitorn/a
Meas. Tech.ChEBML_144915
IC50 3.9±n/a nM
Citation Burkholder, TPKudlacz, EMMaynard, GDLiu, XGLe, TBWebster, MEHorgan, SWWenstrup, DLFreund, DWBoyer, FBratton, LGross, RSKnippenberg, RWLogan, DEJones, BKChen, TMGeary, JLCorrell, MAPoole, JCMandagere, AK Synthesis and structure-activity relationships for a series of substituted pyrrolidine NK1/NK2 receptor antagonists Bioorg Med Chem Lett7:2531-2536 (1997)    Article
 
Substance-P receptor
Name:Substance-P receptor
Type:Enzyme Catalytic Domain
Mol. Mass.:46261.42
Organism:GUINEA PIG
Description:Neurokinin NK1 TACR1 GUINEA PIG::P30547
Residue:407
BDBM50290306
NameBDBM50290306
Synonyms:(1-{2-[(R)-3-(3,4-Dichloro-phenyl)-1-(3,4,5-trimethoxy-benzoyl)-pyrrolidin-3-yl]-ethyl}-4-phenyl-piperidin-4-yl)-(4-methyl-piperazin-1-yl)-methanone; hydrochloride | CHEMBL553617
TypeSmall organic molecule
Emp. Form.C39H48Cl2N4O5
Mol. Mass.723.728
SMILESCOc1cc(cc(OC)c1OC)C(=O)N1CC[C@@](CCN2CCC(CC2)(C(=O)N2CCN(C)CC2)c2ccccc2)(C1)c1ccc(Cl)c(Cl)c1