Reaction Details
TargetIntegrin alpha-IIb/beta-3
LigandBDBM50290325
Substrate/Competitorn/a
Meas. Tech.ChEBML_218215
IC50 24±n/a nM
Citation Fisher, MJGunn, BPHarms, CSKline, ADMullaney, JTScarborough, RMSkelton, MAUm, SLUtterback, BGJakubowski, JA Dihydroisoquinolone RGD mimics. Exploration of the aspartate isostere Bioorg Med Chem Lett7:2537-2542 (1997)    Article
 
Integrin alpha-IIb/beta-3
Name:Integrin alpha-IIb/beta-3
Synonyms:Glycoprotein IIb/IIIa
Type:n/a
Mol. Mass.:n/a
Description:ASSAY_ID of EBI is 30109
Components:This complex has 2 components.
Component 1
Name:Integrin beta-3
Type:Protein
Mol. Mass.:87038.91
Organism:Homo sapiens (Human)
Description:P05106
Residue:788
Component 2
Name:Integrin alpha-IIb
Synonyms:CD_antigen=CD41 GPIIb Glycoprotein IIb ITGA2B Integrin alpha-IIb heavy chain Integrin alpha-IIb light chain, form 2 Integrin alpha-V/beta-3 and alpha-IIb/beta 3 | Platelet membrane glycoprotein IIb
Type:Protein
Mol. Mass.:113354.85
Organism:Homo sapiens (Human)
Description:P08514
Residue:1039
BDBM50290325
NameBDBM50290325
Synonyms:3-[6-(4-Carbamimidoyl-benzyloxy)-1-oxo-3,4-dihydro-1H-isoquinolin-2-yl]-octanoic acid | CHEMBL84820
TypeSmall organic molecule
Emp. Form.C25H31N3O4
Mol. Mass.437.5313
SMILESCCCCCC(CC(O)=O)N1CCc2cc(OCc3ccc(cc3)C(N)=N)ccc2C1=O