Reaction Details
TargetProgesterone receptor
LigandBDBM50290334
Substrate/Competitorn/a
Meas. Tech.ChEBML_159701
IC50 9±n/a nM
Citation Connolly, PJWetter, SKBeers, KNHamel, SCHaynes-Johnson, DKiddoe, MKraft, PLai, MTCampen, CPalmer, SPhillips, A Synthesis and progesterone receptor binding affinity of substituted 1-phenyl-7-benzyl-4,5,6,7-tetrahydro-1H-indazoles Bioorg Med Chem Lett7:2551-2556 (1997)    Article
 
Progesterone receptor
Name:Progesterone receptor
Type:PROTEIN
Mol. Mass.:98665.51
Organism:Oryctolagus cuniculus
Description:ChEMBL_775980
Residue:930
BDBM50290334
NameBDBM50290334
Synonyms:1-(4-Chloro-phenyl)-7-naphthalen-1-ylmethyl-4,5,6,7-tetrahydro-1H-indazole-3-carbaldehyde | CHEMBL87362
TypeSmall organic molecule
Emp. Form.C25H21ClN2O
Mol. Mass.400.9
SMILESClc1ccc(cc1)-n1nc(C=O)c2CCCC(Cc3cccc4ccccc34)c12