Reaction Details
TargetProgesterone receptor
LigandBDBM50290335
Substrate/Competitorn/a
Meas. Tech.ChEBML_159701
IC50 1000±n/a nM
Citation Connolly, PJWetter, SKBeers, KNHamel, SCHaynes-Johnson, DKiddoe, MKraft, PLai, MTCampen, CPalmer, SPhillips, A Synthesis and progesterone receptor binding affinity of substituted 1-phenyl-7-benzyl-4,5,6,7-tetrahydro-1H-indazoles Bioorg Med Chem Lett7:2551-2556 (1997)    Article
 
Progesterone receptor
Name:Progesterone receptor
Type:PROTEIN
Mol. Mass.:98665.51
Organism:Oryctolagus cuniculus
Description:ChEMBL_775980
Residue:930
BDBM50290335
NameBDBM50290335
Synonyms:7-(4-tert-Butyl-benzyl)-1-(4-fluoro-phenyl)-4,5,6,7-tetrahydro-1H-indazole-3-carbaldehyde | CHEMBL86199
TypeSmall organic molecule
Emp. Form.C25H27FN2O
Mol. Mass.390.4931
SMILESCC(C)(C)c1ccc(CC2CCCc3c(C=O)nn(c23)-c2ccc(F)cc2)cc1