Reaction Details
TargetProgesterone receptor
LigandBDBM50290339
Substrate/Competitorn/a
Meas. Tech.ChEBML_159701
IC50>10000±n/a nM
Citation Connolly, PJWetter, SKBeers, KNHamel, SCHaynes-Johnson, DKiddoe, MKraft, PLai, MTCampen, CPalmer, SPhillips, A Synthesis and progesterone receptor binding affinity of substituted 1-phenyl-7-benzyl-4,5,6,7-tetrahydro-1H-indazoles Bioorg Med Chem Lett7:2551-2556 (1997)    Article
 
Progesterone receptor
Name:Progesterone receptor
Type:PROTEIN
Mol. Mass.:98665.51
Organism:Oryctolagus cuniculus
Description:ChEMBL_775980
Residue:930
BDBM50290339
NameBDBM50290339
Synonyms:Benzoic acid [1-[1-(4-fluoro-phenyl)-7-naphthalen-1-ylmethyl-octahydro-indazol-3-yl]-meth-(E)-ylidene]-hydrazide | CHEMBL87692
TypeSmall organic molecule
Emp. Form.C32H31FN4O
Mol. Mass.506.6131
SMILESFc1ccc(cc1)N1N=C(CNNC(=O)c2ccccc2)C2CCCC(Cc3cccc4ccccc34)C12