Reaction Details
TargetProgesterone receptor
LigandBDBM50290350
Substrate/Competitorn/a
Meas. Tech.ChEBML_159701
IC50 1377±n/a nM
Citation Connolly, PJWetter, SKBeers, KNHamel, SCHaynes-Johnson, DKiddoe, MKraft, PLai, MTCampen, CPalmer, SPhillips, A Synthesis and progesterone receptor binding affinity of substituted 1-phenyl-7-benzyl-4,5,6,7-tetrahydro-1H-indazoles Bioorg Med Chem Lett7:2551-2556 (1997)    Article
 
Progesterone receptor
Name:Progesterone receptor
Type:PROTEIN
Mol. Mass.:98665.51
Organism:Oryctolagus cuniculus
Description:ChEMBL_775980
Residue:930
BDBM50290350
NameBDBM50290350
Synonyms:CHEMBL315817 | Diethyl-[1-(4-fluoro-phenyl)-7-naphthalen-1-ylmethyl-4,5,6,7-tetrahydro-1H-indazol-3-ylmethyl]-amine
TypeSmall organic molecule
Emp. Form.C29H32FN3
Mol. Mass.441.5829
SMILESCCN(CC)Cc1nn(c2C(Cc3cccc4ccccc34)CCCc12)-c1ccc(F)cc1