Reaction Details
TargetProgesterone receptor
LigandBDBM50290353
Substrate/Competitorn/a
Meas. Tech.ChEBML_159701
IC50 2.3±n/a nM
Citation Connolly, PJWetter, SKBeers, KNHamel, SCHaynes-Johnson, DKiddoe, MKraft, PLai, MTCampen, CPalmer, SPhillips, A Synthesis and progesterone receptor binding affinity of substituted 1-phenyl-7-benzyl-4,5,6,7-tetrahydro-1H-indazoles Bioorg Med Chem Lett7:2551-2556 (1997)    Article
 
Progesterone receptor
Name:Progesterone receptor
Type:PROTEIN
Mol. Mass.:98665.51
Organism:Oryctolagus cuniculus
Description:ChEMBL_775980
Residue:930
BDBM50290353
NameBDBM50290353
Synonyms:CHEMBL422241 | [1-[1-(4-Fluoro-phenyl)-7-naphthalen-1-ylmethyl-4,5,6,7-tetrahydro-1H-indazol-3-yl]-meth-(E)-ylidene]-phenyl-amine
TypeSmall organic molecule
Emp. Form.C31H26FN3
Mol. Mass.459.5566
SMILESFc1ccc(cc1)-n1nc(\C=N\c2ccccc2)c2CCCC(Cc3cccc4ccccc34)c12