Reaction Details
TargetProgesterone receptor
LigandBDBM50290356
Substrate/Competitorn/a
Meas. Tech.ChEBML_159701
IC50 7.7±n/a nM
Citation Connolly, PJWetter, SKBeers, KNHamel, SCHaynes-Johnson, DKiddoe, MKraft, PLai, MTCampen, CPalmer, SPhillips, A Synthesis and progesterone receptor binding affinity of substituted 1-phenyl-7-benzyl-4,5,6,7-tetrahydro-1H-indazoles Bioorg Med Chem Lett7:2551-2556 (1997)    Article
 
Progesterone receptor
Name:Progesterone receptor
Type:PROTEIN
Mol. Mass.:98665.51
Organism:Oryctolagus cuniculus
Description:ChEMBL_775980
Residue:930
BDBM50290356
NameBDBM50290356
Synonyms:1-(4-Fluoro-phenyl)-7-(4-methyl-benzyl)-4,5,6,7-tetrahydro-1H-indazole-3-carbaldehyde | CHEMBL313626
TypeSmall organic molecule
Emp. Form.C22H21FN2O
Mol. Mass.348.4133
SMILESCc1ccc(CC2CCCc3c(C=O)nn(c23)-c2ccc(F)cc2)cc1