Reaction Details
TargetProgesterone receptor
LigandBDBM50290362
Substrate/Competitorn/a
Meas. Tech.ChEBML_159701
IC50 11±n/a nM
Citation Connolly, PJWetter, SKBeers, KNHamel, SCHaynes-Johnson, DKiddoe, MKraft, PLai, MTCampen, CPalmer, SPhillips, A Synthesis and progesterone receptor binding affinity of substituted 1-phenyl-7-benzyl-4,5,6,7-tetrahydro-1H-indazoles Bioorg Med Chem Lett7:2551-2556 (1997)    Article
 
Progesterone receptor
Name:Progesterone receptor
Type:PROTEIN
Mol. Mass.:98665.51
Organism:Oryctolagus cuniculus
Description:ChEMBL_775980
Residue:930
BDBM50290362
NameBDBM50290362
Synonyms:7-(2-Chloro-benzyl)-1-(4-fluoro-phenyl)-4,5,6,7-tetrahydro-1H-indazole-3-carbaldehyde | CHEMBL314384
TypeSmall organic molecule
Emp. Form.C21H18ClFN2O
Mol. Mass.368.832
SMILESFc1ccc(cc1)-n1nc(C=O)c2CCCC(Cc3ccccc3Cl)c12