Reaction Details
TargetProgesterone receptor
LigandBDBM50290363
Substrate/Competitorn/a
Meas. Tech.ChEBML_159701
IC50 97±n/a nM
Citation Connolly, PJWetter, SKBeers, KNHamel, SCHaynes-Johnson, DKiddoe, MKraft, PLai, MTCampen, CPalmer, SPhillips, A Synthesis and progesterone receptor binding affinity of substituted 1-phenyl-7-benzyl-4,5,6,7-tetrahydro-1H-indazoles Bioorg Med Chem Lett7:2551-2556 (1997)    Article
 
Progesterone receptor
Name:Progesterone receptor
Type:PROTEIN
Mol. Mass.:98665.51
Organism:Oryctolagus cuniculus
Description:ChEMBL_775980
Residue:930
BDBM50290363
NameBDBM50290363
Synonyms:3-[1,3]Dioxolan-2-yl-1-(4-fluoro-phenyl)-7-naphthalen-1-ylmethyl-4,5,6,7-tetrahydro-1H-indazole | CHEMBL314477
TypeSmall organic molecule
Emp. Form.C27H25FN2O2
Mol. Mass.428.498
SMILESFc1ccc(cc1)-n1nc(C2OCCO2)c2CCCC(Cc3cccc4ccccc34)c12