Reaction Details
TargetProgesterone receptor
LigandBDBM50290365
Substrate/Competitorn/a
Meas. Tech.ChEBML_159701
IC50>10000±n/a nM
Citation Connolly, PJWetter, SKBeers, KNHamel, SCHaynes-Johnson, DKiddoe, MKraft, PLai, MTCampen, CPalmer, SPhillips, A Synthesis and progesterone receptor binding affinity of substituted 1-phenyl-7-benzyl-4,5,6,7-tetrahydro-1H-indazoles Bioorg Med Chem Lett7:2551-2556 (1997)    Article
 
Progesterone receptor
Name:Progesterone receptor
Type:PROTEIN
Mol. Mass.:98665.51
Organism:Oryctolagus cuniculus
Description:ChEMBL_775980
Residue:930
BDBM50290365
NameBDBM50290365
Synonyms:1-(4-Fluoro-phenyl)-3-(N'-[(E)-methylene]benzenesulfonohydrazide)-7-naphthalen-1-ylmethyl-octahydro-indazole | CHEMBL313352
TypeSmall organic molecule
Emp. Form.C31H31FN4O2S
Mol. Mass.542.667
SMILESFc1ccc(cc1)N1N=C(CNNS(=O)(=O)c2ccccc2)C2CCCC(Cc3cccc4ccccc34)C12