Reaction Details
TargetProgesterone receptor
LigandBDBM50290370
Substrate/Competitorn/a
Meas. Tech.ChEBML_159701
IC50 1381±n/a nM
Citation Connolly, PJWetter, SKBeers, KNHamel, SCHaynes-Johnson, DKiddoe, MKraft, PLai, MTCampen, CPalmer, SPhillips, A Synthesis and progesterone receptor binding affinity of substituted 1-phenyl-7-benzyl-4,5,6,7-tetrahydro-1H-indazoles Bioorg Med Chem Lett7:2551-2556 (1997)    Article
 
Progesterone receptor
Name:Progesterone receptor
Type:PROTEIN
Mol. Mass.:98665.51
Organism:Oryctolagus cuniculus
Description:ChEMBL_775980
Residue:930
BDBM50290370
NameBDBM50290370
Synonyms:Benzyl-[1-(4-fluoro-phenyl)-7-naphthalen-1-ylmethyl-4,5,6,7-tetrahydro-1H-indazol-3-ylmethyl]-amine | CHEMBL314419
TypeSmall organic molecule
Emp. Form.C32H30FN3
Mol. Mass.475.5991
SMILESFc1ccc(cc1)-n1nc(CNCc2ccccc2)c2CCCC(Cc3cccc4ccccc34)c12