Reaction Details
TargetProgesterone receptor
LigandBDBM50290372
Substrate/Competitorn/a
Meas. Tech.ChEBML_159701
IC50 56±n/a nM
Citation Connolly, PJWetter, SKBeers, KNHamel, SCHaynes-Johnson, DKiddoe, MKraft, PLai, MTCampen, CPalmer, SPhillips, A Synthesis and progesterone receptor binding affinity of substituted 1-phenyl-7-benzyl-4,5,6,7-tetrahydro-1H-indazoles Bioorg Med Chem Lett7:2551-2556 (1997)    Article
 
Progesterone receptor
Name:Progesterone receptor
Type:PROTEIN
Mol. Mass.:98665.51
Organism:Oryctolagus cuniculus
Description:ChEMBL_775980
Residue:930
BDBM50290372
NameBDBM50290372
Synonyms:1-(4-Fluoro-phenyl)-7-naphthalen-2-ylmethyl-octahydro-indazole-3-carbaldehyde | CHEMBL86134
TypeSmall organic molecule
Emp. Form.C25H25FN2O
Mol. Mass.388.4772
SMILESFc1ccc(cc1)N1NC(C=O)C2CCCC(Cc3ccc4ccccc4c3)C12