Reaction Details
TargetProgesterone receptor
LigandBDBM50290375
Substrate/Competitorn/a
Meas. Tech.ChEBML_159701
IC50 49±n/a nM
Citation Connolly, PJWetter, SKBeers, KNHamel, SCHaynes-Johnson, DKiddoe, MKraft, PLai, MTCampen, CPalmer, SPhillips, A Synthesis and progesterone receptor binding affinity of substituted 1-phenyl-7-benzyl-4,5,6,7-tetrahydro-1H-indazoles Bioorg Med Chem Lett7:2551-2556 (1997)    Article
 
Progesterone receptor
Name:Progesterone receptor
Type:PROTEIN
Mol. Mass.:98665.51
Organism:Oryctolagus cuniculus
Description:ChEMBL_775980
Residue:930
BDBM50290375
NameBDBM50290375
Synonyms:CHEMBL314154 | N-[1-[1-(4-Fluoro-phenyl)-7-naphthalen-1-ylmethyl-4,5,6,7-tetrahydro-1H-indazol-3-yl]-meth-(E)-ylidene]-N'-methyl-hydrazine
TypeSmall organic molecule
Emp. Form.C26H25FN4
Mol. Mass.412.5019
SMILESCN=NCc1nn(c2C(Cc3cccc4ccccc34)CCCc12)-c1ccc(F)cc1