Reaction Details
TargetProto-oncogene tyrosine-protein kinase Src
LigandBDBM50290422
Substrate/Competitorn/a
Meas. Tech.ChEBML_216987
IC50 7800±n/a nM
Citation Zimmermann, JBuchdunger, EMett, HMeyer, TLydon, NB Potent and selective inhibitors of the Abl-kinase: phenylamino-pyrimidine (PAP) derivatives Bioorg Med Chem Lett7:187-192 (1997)    Article
 
Proto-oncogene tyrosine-protein kinase Src
Name:Proto-oncogene tyrosine-protein kinase Src
Type:Protein
Mol. Mass.:59838.60
Organism:Homo sapiens (Human)
Description:P12931
Residue:536
BDBM50290422
NameBDBM50290422
Synonyms:4-(4-Methyl-piperazin-1-ylmethyl)-N-[3-(4-pyridin-3-yl-pyrimidin-2-ylamino)-phenyl]-benzamide CHEMBL56904
TypeSmall organic molecule
Emp. Form.C28H29N7O
Mol. Mass.479.5762
SMILESCN1CCN(Cc2ccc(cc2)C(=O)Nc2cccc(Nc3nccc(n3)-c3cccnc3)c2)CC1