Reaction Details
TargetTyrosine-protein kinase ABL1
LigandBDBM50290422
Substrate/Competitorn/a
Meas. Tech.ChEBML_226180
IC50 100±n/a nM
Citation Zimmermann, JBuchdunger, EMett, HMeyer, TLydon, NB Potent and selective inhibitors of the Abl-kinase: phenylamino-pyrimidine (PAP) derivatives Bioorg Med Chem Lett7:187-192 (1997)    Article
 
Tyrosine-protein kinase ABL1
Name:Tyrosine-protein kinase ABL1
Type:Enzyme
Mol. Mass.:122897.30
Organism:Homo sapiens (Human)
Description:P00519
Residue:1130
BDBM50290422
NameBDBM50290422
Synonyms:4-(4-Methyl-piperazin-1-ylmethyl)-N-[3-(4-pyridin-3-yl-pyrimidin-2-ylamino)-phenyl]-benzamide CHEMBL56904
TypeSmall organic molecule
Emp. Form.C28H29N7O
Mol. Mass.479.5762
SMILESCN1CCN(Cc2ccc(cc2)C(=O)Nc2cccc(Nc3nccc(n3)-c3cccnc3)c2)CC1